{"text_format":"3","workbook":"xlsx","n_sheets":2,"sheets":["목록","작성방법 관련"],"not_rendered":{"external_links":2,"defined_names":1,"comments":1},"read":"whole","date_system":"1900"}

{"sheet":"목록","index":0,"n_rows":490,"n_cols":29,"rows_kept":490,"merged":[[0,0,0,26],[1,0,1,3],[3,0,4,0],[3,1,4,1],[3,2,4,2],[3,3,4,3],[3,4,4,4],[3,5,4,5],[3,6,4,6],[3,7,4,7],[3,8,3,9],[3,10,3,12],[3,13,4,13],[3,14,4,14],[3,15,4,15],[3,18,4,18],[3,19,4,19],[3,20,4,20],[3,21,4,21],[3,22,4,22],[3,24,4,26],[3,28,4,29],[5,28,5,29],[6,28,6,29],[7,28,7,29],[8,28,8,29],[9,28,9,29],[10,28,10,29],[11,28,11,29],[12,28,12,29],[13,28,13,29],[14,28,14,29],[15,28,15,29],[16,28,16,29],[17,28,17,29],[18,28,18,29],[19,28,19,29],[20,28,20,29],[21,28,21,29],[22,28,22,29],[23,28,23,29],[24,28,24,29],[25,28,25,29],[26,28,26,29],[27,28,27,29],[28,28,28,29],[29,28,29,29],[30,28,30,29],[31,28,31,29],[32,28,32,29],[33,28,33,29],[34,28,34,29],[35,28,35,29],[36,28,36,29],[37,28,37,29],[38,28,38,29],[39,28,39,29],[40,28,40,29],[41,28,41,29],[42,28,42,29],[43,28,43,29],[44,28,44,29],[45,28,45,29],[46,28,46,29],[47,28,47,29],[48,28,48,29],[49,28,49,29],[50,28,50,29],[51,28,51,29],[52,28,52,29],[53,28,53,29],[54,28,54,29],[55,28,55,29],[56,28,56,29],[57,28,57,29],[58,28,58,29],[59,28,59,29],[60,28,60,29],[61,28,61,29],[62,28,62,29],[63,28,63,29],[64,28,64,29],[65,28,65,29],[66,28,66,29],[67,28,67,29],[68,28,68,29],[69,28,69,29],[70,28,70,29],[71,28,71,29],[72,28,72,29],[73,28,73,29],[74,28,74,29],[75,28,75,29],[76,28,76,29],[77,28,77,29],[78,28,78,29],[79,28,79,29],[80,28,80,29],[81,28,81,29],[82,28,82,29],[83,28,83,29],[84,28,84,29],[85,28,85,29],[86,28,86,29],[87,28,87,29],[88,28,88,29],[89,28,89,29],[90,28,90,29],[91,28,91,29],[92,28,92,29],[93,28,93,29],[94,28,94,29],[95,28,95,29],[96,28,96,29],[97,28,97,29],[98,28,98,29],[99,28,99,29],[100,28,100,29],[101,28,101,29],[102,28,102,29],[103,28,103,29],[104,28,104,29],[105,28,105,29],[106,28,106,29],[107,28,107,29],[108,28,108,29],[109,28,109,29],[110,28,110,29],[111,28,111,29],[112,28,112,29],[113,28,113,29],[114,28,114,29],[115,28,115,29],[116,28,116,29],[117,28,117,29],[118,28,118,29],[119,28,119,29],[120,28,120,29],[121,28,121,29],[122,28,122,29],[123,28,123,29],[124,28,124,29],[125,28,125,29],[126,28,126,29],[127,28,127,29],[128,28,128,29],[129,28,129,29],[130,28,130,29],[131,28,131,29],[132,28,132,29],[133,28,133,29],[134,28,134,29],[135,28,135,29],[136,28,136,29],[137,28,137,29],[138,28,138,29],[139,28,139,29],[140,28,140,29],[141,28,141,29],[142,28,142,29],[143,28,143,29],[144,28,144,29],[145,28,145,29],[146,28,146,29],[147,28,147,29],[148,28,148,29],[149,28,149,29],[150,28,150,29],[151,28,151,29],[152,28,152,29],[153,28,153,29],[154,28,154,29],[155,28,155,29],[156,28,156,29],[157,28,157,29],[158,28,158,29],[159,28,159,29],[160,28,160,29],[161,28,161,29],[162,28,162,29],[163,28,163,29],[164,28,164,29],[165,28,165,29],[166,28,166,29],[167,28,167,29],[168,28,168,29],[169,28,169,29],[170,28,170,29],[171,28,171,29],[172,28,172,29],[173,28,173,29],[174,28,174,29],[175,28,175,29],[176,28,176,29],[177,28,177,29],[178,28,178,29],[179,28,179,29],[180,28,180,29],[181,28,181,29],[182,28,182,29],[183,28,183,29],[184,28,184,29],[185,28,185,29],[186,28,186,29],[187,28,187,29],[188,28,188,29],[189,28,189,29],[190,28,190,29],[191,28,191,29],[192,28,192,29],[193,28,193,29],[194,28,194,29],[195,28,195,29],[196,28,196,29],[197,28,197,29],[198,28,198,29],[199,28,199,29],[200,28,200,29],[201,28,201,29],[202,28,202,29],[203,28,203,29],[204,28,204,29],[205,28,205,29],[206,28,206,29],[207,28,207,29],[208,28,208,29],[209,28,209,29],[210,28,210,29],[211,28,211,29],[212,28,212,29],[213,28,213,29],[214,28,214,29],[215,28,215,29],[216,28,216,29],[217,28,217,29],[218,28,218,29],[219,28,219,29],[220,28,220,29],[221,28,221,29],[222,28,222,29],[223,28,223,29],[224,28,224,29],[225,28,225,29],[226,28,226,29],[227,28,227,29],[228,28,228,29],[229,28,229,29],[230,28,230,29],[231,28,231,29],[232,28,232,29],[233,28,233,29],[234,28,234,29],[235,28,235,29],[236,28,236,29],[237,28,237,29],[238,28,238,29],[239,28,239,29],[240,28,240,29],[241,28,241,29],[242,28,242,29],[243,28,243,29],[244,28,244,29],[245,28,245,29],[246,28,246,29],[247,28,247,29],[248,28,248,29],[249,28,249,29],[250,28,250,29],[251,28,251,29],[252,28,252,29],[253,28,253,29],[254,28,254,29],[255,28,255,29],[256,28,256,29],[257,28,257,29],[258,28,258,29],[259,28,259,29],[260,28,260,29],[261,28,261,29],[262,28,262,29],[263,28,263,29],[264,28,264,29],[265,28,265,29],[266,28,266,29],[267,28,267,29],[268,28,268,29],[269,28,269,29],[270,28,270,29],[271,28,271,29],[272,28,272,29],[273,28,273,29],[274,28,274,29],[275,28,275,29],[276,28,276,29],[277,28,277,29],[278,28,278,29],[279,28,279,29],[280,28,280,29],[281,28,281,29],[282,28,282,29],[283,28,283,29],[284,28,284,29],[285,28,285,29],[286,28,286,29],[287,28,287,29],[288,28,288,29],[289,28,289,29],[290,28,290,29],[291,28,291,29],[292,28,292,29],[293,28,293,29],[294,28,294,29],[295,28,295,29],[296,28,296,29],[297,28,297,29],[298,28,298,29],[299,28,299,29],[300,28,300,29],[301,28,301,29],[302,28,302,29],[303,28,303,29],[304,28,304,29],[305,28,305,29],[306,28,306,29],[307,28,307,29],[308,28,308,29],[309,28,309,29],[310,28,310,29],[311,28,311,29],[312,28,312,29],[313,28,313,29],[314,28,314,29],[315,28,315,29],[316,28,316,29],[317,28,317,29],[318,28,318,29],[319,28,319,29],[320,28,320,29],[321,28,321,29],[322,28,322,29],[323,28,323,29],[324,28,324,29],[325,28,325,29],[326,28,326,29],[327,28,327,29],[328,28,328,29],[329,28,329,29],[330,28,330,29],[331,28,331,29],[332,28,332,29],[333,28,333,29],[334,28,334,29],[335,28,335,29],[336,28,336,29],[337,28,337,29],[338,28,338,29],[339,28,339,29],[340,28,340,29],[341,28,341,29],[342,28,342,29],[343,28,343,29],[344,28,344,29],[345,28,345,29],[346,28,346,29],[347,28,347,29],[348,28,348,29],[349,28,349,29],[350,28,350,29],[351,28,351,29],[352,28,352,29],[353,28,353,29],[354,28,354,29],[355,28,355,29],[356,28,356,29],[357,28,357,29],[358,28,358,29],[359,28,359,29],[360,28,360,29],[361,28,361,29],[362,28,362,29],[363,28,363,29],[364,28,364,29],[365,28,365,29],[366,28,366,29],[367,28,367,29],[368,28,368,29],[369,28,369,29],[370,28,370,29],[371,28,371,29],[372,28,372,29],[373,28,373,29],[374,28,374,29],[375,28,375,29],[376,28,376,29],[377,28,377,29],[378,28,378,29],[379,28,379,29],[380,28,380,29],[381,28,381,29],[382,28,382,29],[383,28,383,29],[384,28,384,29],[385,28,385,29],[386,28,386,29],[387,28,387,29],[388,28,388,29],[389,28,389,29],[390,28,390,29],[391,28,391,29],[392,28,392,29],[393,28,393,29],[394,28,394,29],[395,28,395,29],[396,28,396,29],[397,28,397,29],[398,28,398,29],[399,28,399,29],[400,28,400,29],[401,28,401,29],[402,28,402,29],[403,28,403,29],[404,28,404,29],[405,28,405,29],[406,28,406,29],[407,28,407,29],[408,28,408,29],[409,28,409,29],[410,28,410,29],[411,28,411,29],[412,28,412,29],[413,28,413,29],[414,28,414,29],[415,28,415,29],[416,28,416,29],[417,28,417,29],[418,28,418,29],[419,28,419,29],[420,28,420,29],[421,28,421,29],[422,28,422,29],[423,28,423,29],[424,28,424,29],[425,28,425,29],[426,28,426,29],[427,28,427,29],[428,28,428,29],[429,28,429,29],[430,28,430,29],[431,28,431,29],[432,28,432,29],[433,28,433,29],[434,28,434,29],[435,28,435,29],[436,28,436,29],[437,28,437,29],[438,28,438,29],[439,28,439,29],[440,28,440,29],[441,28,441,29],[442,28,442,29],[443,28,443,29],[444,28,444,29],[445,28,445,29],[446,28,446,29],[447,28,447,29],[448,28,448,29],[449,28,449,29],[450,28,450,29],[451,28,451,29],[452,28,452,29],[453,28,453,29],[454,28,454,29],[455,28,455,29],[456,28,456,29],[457,28,457,29],[458,28,458,29],[459,28,459,29],[460,28,460,29],[461,28,461,29],[462,28,462,29],[463,28,463,29],[464,28,464,29],[465,28,465,29],[466,28,466,29],[467,28,467,29],[468,28,468,29],[469,28,469,29],[470,28,470,29],[471,28,471,29],[472,28,472,29],[473,28,473,29],[474,28,474,29],[475,28,475,29],[476,28,476,29],[477,28,477,29],[478,28,478,29],[479,28,479,29],[480,28,480,29],[481,28,481,29],[482,28,482,29],[483,28,483,29],[484,28,484,29],[485,28,485,29],[486,28,486,29],[487,28,487,29],[488,28,488,29],[489,28,489,29]]}
["목포시 유휴 공유재산(토지, 건물) 공개 목록('26.5월말 기준)"]
[]
[1,2,3,4,5,6,7,8,9,10,11,12,13,14,15,16,17,18,19,null,20,21,22,null,null,23,null,null,24]
["연번","지방정부 코드","지방정부명","물건명","소재지(지번)","주소의 지번주소","소재지(도로명)","토지/건물","토지",null,"건물",null,null,"공개여부","재산구분(행정/일반)","재산관리관","행정재산","일반재신","사용허가·대부 불가 사유","유휴사유코드","유휴사유명","유휴사유 상세설명","활용계획(예: 대부, 매각, 용도폐지 등)",null,"오류 검증",{"$nulls":3},"담당자 연락처"]
[{"$nulls":8},"지목","면적(㎡)","건물구분","건물용도","연면적(㎡)",{"$nulls":3},"사용허가가능여부","대부/매각선택"]
["합계",null,null,{"$f":"SUBTOTAL(3,D7:D497)","v":484},{"$nulls":5},{"$f":"SUBTOTAL(9,J7:J497)","v":51889.560000000005},{"$f":"SUBTOTAL(3,K386:K486)","v":0},{"$f":"SUBTOTAL(3,L386:L486)","v":0},{"$f":"SUBTOTAL(3,M386:M486)","v":0}]
[1,4800000,"목포시","전라남도 목포시 용당동 188-82 ","전라남도 목포시 용당동 188-82 ","전라남도 목포시 용당동 188-82 ",null,"토지","대",{"v":34.7,"d":"35"},{"$nulls":3},"공개","일반재산","회계과",null,"대부/매각대상",null,"G05","단순미활용 상태","현장 확인 후 매각 추진","대부 및 매각 신청 시 검토예정",null,{"$f":"VLOOKUP(O7,'작성방법 관련'!$E$3:$F$5,2)","v":"G"},{"$f":"LEFT(T7,1)","v":"G"},{"$f":"EXACT(Y7,Z7)","v":true},null,"061-270-3273"]
[2,4800000,"목포시","전라남도 목포시 용당동 188-162 ","전라남도 목포시 용당동 188-162 ","전라남도 목포시 용당동 188-162 ",null,"토지","대",42,{"$nulls":3},"공개","일반재산","회계과",null,"대부/매각대상",null,"G05","단순미활용 상태","현장 확인 후 매각 추진","대부 및 매각 신청 시 검토예정",null,{"$f":"VLOOKUP(O8,'작성방법 관련'!$E$3:$F$5,2)","v":"G"},"G",true,null,"061-270-3273"]
[3,4800000,"목포시","전라남도 목포시 용당동 947-271 ","전라남도 목포시 용당동 947-271 ","전라남도 목포시 용당동 947-271 ",null,"토지","잡종지",{"v":96.7,"d":"97"},{"$nulls":3},"공개","일반재산","회계과",null,"대부/매각대상",null,"G05","단순미활용 상태","현장 확인 후 매각 추진","대부 및 매각 신청 시 검토예정",null,{"$f":"VLOOKUP(O9,'작성방법 관련'!$E$3:$F$5,2)","v":"G"},"G",true,null,"061-270-3273"]
[4,4800000,"목포시","전라남도 목포시 용당동 955-360 ","전라남도 목포시 용당동 955-360 ","전라남도 목포시 용당동 955-360 ",null,"토지","전",{"v":2.9,"d":"3"},{"$nulls":3},"공개","일반재산","회계과",null,"대부/매각대상",null,"G05","단순미활용 상태","현장 확인 후 매각 추진","대부 및 매각 신청 시 검토예정",null,{"$f":"VLOOKUP(O10,'작성방법 관련'!$E$3:$F$5,2)","v":"G"},"G",true,null,"061-270-3273"]
[5,4800000,"목포시","전라남도 목포시 용당동 955-362 ","전라남도 목포시 용당동 955-362 ","전라남도 목포시 용당동 955-362 ",null,"토지","대",{"v":11.4,"d":"11"},{"$nulls":3},"공개","일반재산","회계과",null,"대부/매각대상",null,"G05","단순미활용 상태","현장 확인 후 매각 추진","대부 및 매각 신청 시 검토예정",null,{"$f":"VLOOKUP(O11,'작성방법 관련'!$E$3:$F$5,2)","v":"G"},"G",true,null,"061-270-3273"]
[6,4800000,"목포시","전라남도 목포시 용당동 964-74 ","전라남도 목포시 용당동 964-74 ","전라남도 목포시 용당동 964-74 ",null,"토지","대",33,{"$nulls":3},"공개","일반재산","회계과",null,"대부/매각대상",null,"G05","단순미활용 상태","현장 확인 후 매각 추진","대부 및 매각 신청 시 검토예정",null,{"$f":"VLOOKUP(O12,'작성방법 관련'!$E$3:$F$5,2)","v":"G"},"G",true,null,"061-270-3273"]
[7,4800000,"목포시","전라남도 목포시 용당동 964-218 ","전라남도 목포시 용당동 964-218 ","전라남도 목포시 용당동 964-218 ",null,"토지","전",42,{"$nulls":3},"공개","일반재산","회계과",null,"대부/매각대상",null,"G05","단순미활용 상태","현장 확인 후 매각 추진","대부 및 매각 신청 시 검토예정",null,{"$f":"VLOOKUP(O13,'작성방법 관련'!$E$3:$F$5,2)","v":"G"},"G",true,null,"061-270-3273"]
[8,4800000,"목포시","전라남도 목포시 용당동 967-65 ","전라남도 목포시 용당동 967-65 ","전라남도 목포시 용당동 967-65 ",null,"토지","대",{"v":25.2,"d":"25"},{"$nulls":3},"공개","일반재산","회계과",null,"대부/매각대상",null,"G05","단순미활용 상태","현장 확인 후 매각 추진","대부 및 매각 신청 시 검토예정",null,{"$f":"VLOOKUP(O14,'작성방법 관련'!$E$3:$F$5,2)","v":"G"},"G",true,null,"061-270-3273"]
[9,4800000,"목포시","전라남도 목포시 용당동 967-510 ","전라남도 목포시 용당동 967-510 ","전라남도 목포시 용당동 967-510 ",null,"토지","대",{"v":3.6,"d":"4"},{"$nulls":3},"공개","일반재산","회계과",null,"대부/매각대상",null,"G05","단순미활용 상태","현장 확인 후 매각 추진","대부 및 매각 신청 시 검토예정",null,{"$f":"VLOOKUP(O15,'작성방법 관련'!$E$3:$F$5,2)","v":"G"},"G",true,null,"061-270-3273"]
[10,4800000,"목포시","전라남도 목포시 용당동 972-13 ","전라남도 목포시 용당동 972-13 ","전라남도 목포시 용당동 972-13 ",null,"토지","전",{"v":219.7,"d":"220"},{"$nulls":3},"공개","일반재산","회계과",null,"대부/매각대상",null,"G05","단순미활용 상태","현장 확인 후 매각 추진","대부 및 매각 신청 시 검토예정",null,{"$f":"VLOOKUP(O16,'작성방법 관련'!$E$3:$F$5,2)","v":"G"},"G",true,null,"061-270-3273"]
[11,4800000,"목포시","전라남도 목포시 용당동 972-195 ","전라남도 목포시 용당동 972-195 ","전라남도 목포시 용당동 972-195 ",null,"토지","전",{"v":365.3,"d":"365"},{"$nulls":3},"공개","일반재산","회계과",null,"대부/매각대상",null,"G05","단순미활용 상태","현장 확인 후 매각 추진","대부 및 매각 신청 시 검토예정",null,{"$f":"VLOOKUP(O17,'작성방법 관련'!$E$3:$F$5,2)","v":"G"},"G",true,null,"061-270-3273"]
[12,4800000,"목포시","전라남도 목포시 산정동 18-89 ","전라남도 목포시 산정동 18-89 ","전라남도 목포시 산정동 18-89 ",null,"토지","대",33,{"$nulls":3},"공개","일반재산","회계과",null,"대부/매각대상",null,"G05","단순미활용 상태","현장 확인 후 매각 추진","대부 및 매각 신청 시 검토예정",null,{"$f":"VLOOKUP(O18,'작성방법 관련'!$E$3:$F$5,2)","v":"G"},"G",true,null,"061-270-3273"]
[13,4800000,"목포시","전라남도 목포시 산정동 23-95 ","전라남도 목포시 산정동 23-95 ","전라남도 목포시 산정동 23-95 ",null,"토지","대",7,{"$nulls":3},"공개","일반재산","회계과",null,"대부/매각대상",null,"G05","단순미활용 상태","현장 확인 후 매각 추진","대부 및 매각 신청 시 검토예정",null,{"$f":"VLOOKUP(O19,'작성방법 관련'!$E$3:$F$5,2)","v":"G"},"G",true,null,"061-270-3273"]
[14,4800000,"목포시","전라남도 목포시 산정동 23-96 ","전라남도 목포시 산정동 23-96 ","전라남도 목포시 산정동 23-96 ",null,"토지","대",16,{"$nulls":3},"공개","일반재산","회계과",null,"대부/매각대상",null,"G05","단순미활용 상태","현장 확인 후 매각 추진","대부 및 매각 신청 시 검토예정",null,{"$f":"VLOOKUP(O20,'작성방법 관련'!$E$3:$F$5,2)","v":"G"},"G",true,null,"061-270-3273"]
[15,4800000,"목포시","전라남도 목포시 산정동 23-180 ","전라남도 목포시 산정동 23-180 ","전라남도 목포시 산정동 23-180 ",null,"토지","대",25,{"$nulls":3},"공개","일반재산","회계과",null,"대부/매각대상",null,"G05","단순미활용 상태","현장 확인 후 매각 추진","대부 및 매각 신청 시 검토예정",null,{"$f":"VLOOKUP(O21,'작성방법 관련'!$E$3:$F$5,2)","v":"G"},"G",true,null,"061-270-3273"]
[16,4800000,"목포시","전라남도 목포시 산정동 32-3 ","전라남도 목포시 산정동 32-3 ","전라남도 목포시 산정동 32-3 ",null,"토지","대",91,{"$nulls":3},"공개","일반재산","회계과",null,"대부/매각대상",null,"G05","단순미활용 상태","현장 확인 후 매각 추진","대부 및 매각 신청 시 검토예정",null,{"$f":"VLOOKUP(O22,'작성방법 관련'!$E$3:$F$5,2)","v":"G"},"G",true,null,"061-270-3273"]
[17,4800000,"목포시","전라남도 목포시 산정동 41-6 ","전라남도 목포시 산정동 41-6 ","전라남도 목포시 산정동 41-6 ",null,"토지","전",38,{"$nulls":3},"공개","일반재산","회계과",null,"대부/매각대상",null,"G05","단순미활용 상태","현장 확인 후 매각 추진","대부 및 매각 신청 시 검토예정",null,{"$f":"VLOOKUP(O23,'작성방법 관련'!$E$3:$F$5,2)","v":"G"},"G",true,null,"061-270-3273"]
[18,4800000,"목포시","전라남도 목포시 산정동 41-52 ","전라남도 목포시 산정동 41-52 ","전라남도 목포시 산정동 41-52 ",null,"토지","전",1,{"$nulls":3},"공개","일반재산","회계과",null,"대부/매각대상",null,"G05","단순미활용 상태","현장 확인 후 매각 추진","대부 및 매각 신청 시 검토예정",null,{"$f":"VLOOKUP(O24,'작성방법 관련'!$E$3:$F$5,2)","v":"G"},"G",true,null,"061-270-3273"]
[19,4800000,"목포시","전라남도 목포시 산정동 41-55 ","전라남도 목포시 산정동 41-55 ","전라남도 목포시 산정동 41-55 ",null,"토지","전",3,{"$nulls":3},"공개","일반재산","회계과",null,"대부/매각대상",null,"G05","단순미활용 상태","현장 확인 후 매각 추진","대부 및 매각 신청 시 검토예정",null,{"$f":"VLOOKUP(O25,'작성방법 관련'!$E$3:$F$5,2)","v":"G"},"G",true,null,"061-270-3273"]
[20,4800000,"목포시","전라남도 목포시 산정동 42-44 ","전라남도 목포시 산정동 42-44 ","전라남도 목포시 산정동 42-44 ",null,"토지","전",27,{"$nulls":3},"공개","일반재산","회계과",null,"대부/매각대상",null,"G05","단순미활용 상태","현장 확인 후 매각 추진","대부 및 매각 신청 시 검토예정",null,{"$f":"VLOOKUP(O26,'작성방법 관련'!$E$3:$F$5,2)","v":"G"},"G",true,null,"061-270-3273"]
[21,4800000,"목포시","전라남도 목포시 산정동 43-63 ","전라남도 목포시 산정동 43-63 ","전라남도 목포시 산정동 43-63 ",null,"토지","대",11,{"$nulls":3},"공개","일반재산","회계과",null,"대부/매각대상",null,"G05","단순미활용 상태","현장 확인 후 매각 추진","대부 및 매각 신청 시 검토예정",null,{"$f":"VLOOKUP(O27,'작성방법 관련'!$E$3:$F$5,2)","v":"G"},"G",true,null,"061-270-3273"]
[22,4800000,"목포시","전라남도 목포시 산정동 43-72 ","전라남도 목포시 산정동 43-72 ","전라남도 목포시 산정동 43-72 ",null,"토지","대",19,{"$nulls":3},"공개","일반재산","회계과",null,"대부/매각대상",null,"G05","단순미활용 상태","현장 확인 후 매각 추진","대부 및 매각 신청 시 검토예정",null,{"$f":"VLOOKUP(O28,'작성방법 관련'!$E$3:$F$5,2)","v":"G"},"G",true,null,"061-270-3273"]
[23,4800000,"목포시","전라남도 목포시 산정동 43-74 ","전라남도 목포시 산정동 43-74 ","전라남도 목포시 산정동 43-74 ",null,"토지","대",45,{"$nulls":3},"공개","일반재산","회계과",null,"대부/매각대상",null,"G05","단순미활용 상태","현장 확인 후 매각 추진","대부 및 매각 신청 시 검토예정",null,{"$f":"VLOOKUP(O29,'작성방법 관련'!$E$3:$F$5,2)","v":"G"},"G",true,null,"061-270-3273"]
[24,4800000,"목포시","전라남도 목포시 산정동 43-78 ","전라남도 목포시 산정동 43-78 ","전라남도 목포시 산정동 43-78 ",null,"토지","대",8,{"$nulls":3},"공개","일반재산","회계과",null,"대부/매각대상",null,"G05","단순미활용 상태","현장 확인 후 매각 추진","대부 및 매각 신청 시 검토예정",null,{"$f":"VLOOKUP(O30,'작성방법 관련'!$E$3:$F$5,2)","v":"G"},"G",true,null,"061-270-3273"]
[25,4800000,"목포시","전라남도 목포시 산정동 44-34 ","전라남도 목포시 산정동 44-34 ","전라남도 목포시 산정동 44-34 ",null,"토지","대",50,{"$nulls":3},"공개","일반재산","회계과",null,"대부/매각대상",null,"G05","단순미활용 상태","현장 확인 후 매각 추진","대부 및 매각 신청 시 검토예정",null,{"$f":"VLOOKUP(O31,'작성방법 관련'!$E$3:$F$5,2)","v":"G"},"G",true,null,"061-270-3273"]
[26,4800000,"목포시","전라남도 목포시 산정동 44-179 ","전라남도 목포시 산정동 44-179 ","전라남도 목포시 산정동 44-179 ",null,"토지","대",12,{"$nulls":3},"공개","일반재산","회계과",null,"대부/매각대상",null,"G05","단순미활용 상태","현장 확인 후 매각 추진","대부 및 매각 신청 시 검토예정",null,{"$f":"VLOOKUP(O32,'작성방법 관련'!$E$3:$F$5,2)","v":"G"},"G",true,null,"061-270-3273"]
[27,4800000,"목포시","전라남도 목포시 산정동 46-5 ","전라남도 목포시 산정동 46-5 ","전라남도 목포시 산정동 46-5 ",null,"토지","대",72,{"$nulls":3},"공개","일반재산","회계과",null,"대부/매각대상",null,"G05","단순미활용 상태","현장 확인 후 매각 추진","대부 및 매각 신청 시 검토예정",null,{"$f":"VLOOKUP(O33,'작성방법 관련'!$E$3:$F$5,2)","v":"G"},"G",true,null,"061-270-3273"]
[28,4800000,"목포시","전라남도 목포시 산정동 46-33 ","전라남도 목포시 산정동 46-33 ","전라남도 목포시 산정동 46-33 ",null,"토지","대",6,{"$nulls":3},"공개","일반재산","회계과",null,"대부/매각대상",null,"G05","단순미활용 상태","현장 확인 후 매각 추진","대부 및 매각 신청 시 검토예정",null,{"$f":"VLOOKUP(O34,'작성방법 관련'!$E$3:$F$5,2)","v":"G"},"G",true,null,"061-270-3273"]
[29,4800000,"목포시","전라남도 목포시 산정동 74-80 ","전라남도 목포시 산정동 74-80 ","전라남도 목포시 산정동 74-80 ",null,"토지","대",71,{"$nulls":3},"공개","일반재산","회계과",null,"대부/매각대상",null,"G05","단순미활용 상태","현장 확인 후 매각 추진","대부 및 매각 신청 시 검토예정",null,{"$f":"VLOOKUP(O35,'작성방법 관련'!$E$3:$F$5,2)","v":"G"},"G",true,null,"061-270-3273"]
[30,4800000,"목포시","전라남도 목포시 산정동 86-44 ","전라남도 목포시 산정동 86-44 ","전라남도 목포시 산정동 86-44 ",null,"토지","대",25,{"$nulls":3},"공개","일반재산","회계과",null,"대부/매각대상",null,"G05","단순미활용 상태","현장 확인 후 매각 추진","대부 및 매각 신청 시 검토예정",null,{"$f":"VLOOKUP(O36,'작성방법 관련'!$E$3:$F$5,2)","v":"G"},"G",true,null,"061-270-3273"]
[31,4800000,"목포시","전라남도 목포시 산정동 95 ","전라남도 목포시 산정동 95 ","전라남도 목포시 산정동 95 ",null,"토지","대",26,{"$nulls":3},"공개","일반재산","회계과",null,"대부/매각대상",null,"G05","단순미활용 상태","현장 확인 후 매각 추진","대부 및 매각 신청 시 검토예정",null,{"$f":"VLOOKUP(O37,'작성방법 관련'!$E$3:$F$5,2)","v":"G"},"G",true,null,"061-270-3273"]
[32,4800000,"목포시","전라남도 목포시 산정동 95-4 ","전라남도 목포시 산정동 95-4 ","전라남도 목포시 산정동 95-4 ",null,"토지","대",20,{"$nulls":3},"공개","일반재산","회계과",null,"대부/매각대상",null,"G05","단순미활용 상태","현장 확인 후 매각 추진","대부 및 매각 신청 시 검토예정",null,{"$f":"VLOOKUP(O38,'작성방법 관련'!$E$3:$F$5,2)","v":"G"},"G",true,null,"061-270-3273"]
[33,4800000,"목포시","전라남도 목포시 산정동 95-7 ","전라남도 목포시 산정동 95-7 ","전라남도 목포시 산정동 95-7 ",null,"토지","대",6,{"$nulls":3},"공개","일반재산","회계과",null,"대부/매각대상",null,"G05","단순미활용 상태","현장 확인 후 매각 추진","대부 및 매각 신청 시 검토예정",null,{"$f":"VLOOKUP(O39,'작성방법 관련'!$E$3:$F$5,2)","v":"G"},"G",true,null,"061-270-3273"]
[34,4800000,"목포시","전라남도 목포시 산정동 110-18 ","전라남도 목포시 산정동 110-18 ","전라남도 목포시 산정동 110-18 ",null,"토지","대",7,{"$nulls":3},"공개","일반재산","회계과",null,"대부/매각대상",null,"G05","단순미활용 상태","현장 확인 후 매각 추진","대부 및 매각 신청 시 검토예정",null,{"$f":"VLOOKUP(O40,'작성방법 관련'!$E$3:$F$5,2)","v":"G"},"G",true,null,"061-270-3273"]
{"$rows_left_out":451}
{"sheet":"작성방법 관련","index":1,"n_rows":32,"n_cols":22,"rows_kept":32,"merged":[[1,4,1,5],[2,7,2,8],[2,11,2,12],[2,14,2,15],[2,17,2,18],[2,20,2,21]]}
[]
[null,null,20,null,"15, 오류검증",null,null,8,{"$nulls":3},9,null,null,11,null,null,12,null,null,18]
[null,"코드","유휴사유 분류",null,"구분","코드",null,"토지/건물 구분\nOJ0001",{"$nulls":3},"토지(공부)지목\nOJ0002",null,null,"건물구분\nOJ0007",null,null,"건물용도\nOJ0003",null,null,"대부/매각"]
[null,"A01","사용허가 가능 재산(공실 등)",null,"일반재산","G",null,"01","토지",null,null,1,"전",null,"10","사무소",null,1,"단독주택",null,"01","대부대상"]
[null,"A02","용도폐지 대상",null,"행정재산","A",null,"02","건물",null,null,2,"답",null,"50","주택",null,2,"공동주택",null,"02","매각대상"]
[null,"G01","대부계약 만료 후 미대부 상태",{"$nulls":8},3,"과수원",null,"99","기타",null,3,"제1종 근린생활시설",null,"03","대부/매각대상"]
[null,"G02","대부 예정 재산",{"$nulls":8},4,"목장용지",{"$nulls":4},4,"제2종 근린생활시설"]
[null,"G03","무단점유 재산",{"$nulls":8},5,"임야",{"$nulls":4},5,"문화 및 집회시설"]
[null,"G04","누락재산 중 미활용 상태",{"$nulls":8},6,"광천지",{"$nulls":4},6,"판매 및 영업시설"]
[null,"G05","단순 미활용",{"$nulls":8},7,"염전",{"$nulls":4},7,"의료시설"]
[{"$nulls":11},8,"대",{"$nulls":4},8,"교육연구 및 복지시설"]
[{"$nulls":11},9,"공장용지",{"$nulls":4},9,"운동시설"]
[{"$nulls":11},10,"학교용지",{"$nulls":4},10,"업무시설"]
[{"$nulls":11},11,"주차장",{"$nulls":4},11,"숙박시설"]
[{"$nulls":11},12,"주유소용지",{"$nulls":4},12,"위락시설"]
[{"$nulls":11},13,"창고용지",{"$nulls":4},13,"공장"]
[{"$nulls":11},14,"도로",{"$nulls":4},14,"창고시설"]
[{"$nulls":11},15,"철도용지",{"$nulls":4},15,"위험물저장 및 처리시설"]
[{"$nulls":11},16,"제방",{"$nulls":4},16,"자동차관련시설"]
[{"$nulls":11},17,"하천",{"$nulls":4},17,"동물 및 식물관련시설"]
[{"$nulls":11},18,"구거",{"$nulls":4},18,"분뇨 및 쓰레기처리시설"]
[{"$nulls":11},19,"유지",{"$nulls":4},19,"공공용시설"]
[{"$nulls":11},20,"양어장",{"$nulls":4},20,"묘지관련시설"]
[{"$nulls":11},21,"수도용지",{"$nulls":4},21,"관광휴게시설"]
[{"$nulls":11},22,"공원",{"$nulls":4},22,"노유자(노인 및 어린이)시설"]
[{"$nulls":11},23,"체육용지",{"$nulls":4},23,"수련시설"]
[{"$nulls":11},24,"유원지",{"$nulls":4},24,"운수시설"]
[{"$nulls":11},25,"종교용지",{"$nulls":4},25,"자원순환 관련 시설"]
[{"$nulls":11},26,"사적지",{"$nulls":4},26,"교정 및 군사 시설"]
[{"$nulls":11},27,"묘지",{"$nulls":4},27,"방송통신시설"]
[{"$nulls":11},28,"잡종지",{"$nulls":4},28,"발전시설"]
[{"$nulls":17},99,"기타"]